wood burning stoves 2.0*
The moose likes Ant, Maven and Other Build Tools and the fly likes ANT BUILD FAILED:Error starting modern compiler Big Moose Saloon
  Search | Java FAQ | Recent Topics | Flagged Topics | Hot Topics | Zero Replies
Register / Login
JavaRanch » Java Forums » Engineering » Ant, Maven and Other Build Tools
Bookmark "ANT BUILD FAILED:Error starting modern compiler" Watch "ANT BUILD FAILED:Error starting modern compiler" New topic
Author

ANT BUILD FAILED:Error starting modern compiler

Murali Sridhar
Ranch Hand

Joined: Feb 16, 2009
Posts: 44

Hello,

While running the target name="compile" of build,getting the following error:
BUILD FAILED
C:\WebApps\XXCient\build\axis\build.xml:52: Error starting modern compiler

Total time: 545 milliseconds
----------------------------------------------------------------------------------
The IDE I'm using is MyEclipse 6.6.0 .
I have set up the ANT-HOME in env. var and uploaded the tools.jar file to Preferences-->ANT-->Runtime

Here is my build compile target:


I would appreciate your help..

Warm Regards,
Murali.


Regards,
Murali
David Newton
Author
Rancher

Joined: Sep 29, 2008
Posts: 12617

Please UseCodeTags.

If you're having an issue with the "codegen" target, you should post that one, not "compile".
 
I agree. Here's the link: http://aspose.com/file-tools
 
subject: ANT BUILD FAILED:Error starting modern compiler