This week's book giveaway is in the OO, Patterns, UML and Refactoring forum.
We're giving away four copies of Five Lines of Code and have Christian Clausen on-line!
See this thread for details.
Win a copy of Five Lines of Code this week in the OO, Patterns, UML and Refactoring forum!

Dass Leyo Antoniraj

Ranch Hand
+ Follow
since Dec 24, 2013
Cows and Likes
Cows
Total received
0
In last 30 days
0
Total given
0
Likes
Total received
0
Received in last 30 days
0
Total given
1
Given in last 30 days
0
Forums and Threads
Scavenger Hunt
expand Ranch Hand Scavenger Hunt
expand Greenhorn Scavenger Hunt

Recent posts by Dass Leyo Antoniraj

thanks for your reply but i have abandoned the project
6 years ago
when i use mvn install in the comand prompt

i have this error
6 years ago
sorry to ask you like
is it possible send some screen shots how the web explorer works
sorry and thanks
6 years ago
ok thank you.
just one question whether you have already executed and it works ?
thank you once again
6 years ago
thanks for your reply.
as soon as i downloaded the project and imported into eclipse i have the follwoing error
6 years ago

hello i'm new to this environment and i dont know what this sentence means You can install it in the local repository by opening the master project and building it once. .
what i understood is i should import the pom of parent and rebuild it ?
could you please correct me if i'm wrong
6 years ago
hello,

i have downloaded the program from github ModeShape/modeshape-examples ยท GitHub

and when i import into eclipse and if do maven test i have the following errors :

SLF4J: Failed to load class "org.slf4j.impl.StaticLoggerBinder".
SLF4J: Defaulting to no-operation (NOP) logger implementation
SLF4J: See http://www.slf4j.org/codes.html#StaticLoggerBinder for further details.
[INFO] Scanning for projects...
[WARNING]
[WARNING] Some problems were encountered while building the effective model for org.modeshape:modeshape-web-explorer:war:3.7-SNAPSHOT
[WARNING] 'dependencies.dependency.(groupId:artifactId:type:classifier)' must be unique: javax.jcr:jcr:jar -> version 2.0 vs (?) @ line 72, column 15
[WARNING] 'dependencies.dependency.(groupId:artifactId:type:classifier)' must be unique: org.modeshape:modeshape-common:jar -> version 3.7.4.Final vs 3.7.2.Final @ line 77, column 15
[WARNING] 'dependencies.dependency.(groupId:artifactId:type:classifier)' must be unique: joda-time:joda-time:jar -> version 1.6.2 vs (?) @ line 83, column 15
[WARNING] 'dependencies.dependency.(groupId:artifactId:type:classifier)' must be unique: org.modeshape:modeshape-web-jcr:jar -> duplicate declaration of version 3.7.2.Final @ line 90, column 15
[WARNING] 'dependencies.dependency.(groupId:artifactId:type:classifier)' must be unique: org.slf4j:slf4j-api:jar -> version 1.6.1 vs (?) @ line 95, column 15
[WARNING] 'dependencies.dependency.(groupId:artifactId:type:classifier)' must be unique: org.slf4j:slf4j-log4j12:jar -> version 1.6.1 vs (?) @ line 99, column 15
[WARNING] 'dependencies.dependency.(groupId:artifactId:type:classifier)' must be unique: log4j:log4j:jar -> version 1.2.16 vs (?) @ line 103, column 15
[WARNING] 'dependencies.dependency.(groupId:artifactId:type:classifier)' must be unique: junit:junit-dep:jar -> version 4.10 vs (?) @ line 107, column 15
[WARNING] 'dependencies.dependency.(groupId:artifactId:type:classifier)' must be unique: com.googlecode.sardine:sardine:jar -> version 146 vs (?) @ line 111, column 15
[WARNING] 'dependencies.dependency.(groupId:artifactId:type:classifier)' must be unique: com.google.gwt:gwt-servlet:jar -> version 2.5.1 vs (?) @ line 115, column 15
[WARNING] 'dependencies.dependency.(groupId:artifactId:type:classifier)' must be unique: com.googlecode.sardine:sardine:jar -> duplicate declaration of version 146 @ line 144, column 15
[WARNING] 'dependencies.dependency.(groupId:artifactId:type:classifier)' must be unique: org.slf4j:slf4j-log4j12:jar -> duplicate declaration of version 1.6.1 @ line 159, column 15
[WARNING] 'dependencies.dependency.(groupId:artifactId:type:classifier)' must be unique: com.smartgwt:smartgwt-skins:jar -> version (?) vs 2.4 @ line 164, column 15
[WARNING] 'dependencies.dependency.(groupId:artifactId:type:classifier)' must be unique: javax.validation:validation-api:jar -> duplicate declaration of version 1.0.0.GA @ line 169, column 15
[WARNING] 'parent.relativePath' of POM org.modeshape:modeshape-parent:3.7-SNAPSHOT (C:\Projet_Gestion_Documents\Projects\TEST_MODSHAPE\modeshape-master\modeshape-parent\pom.xml) points at org.modeshape:modeshape instead of org.jboss:jboss-parent, please verify your project structure @ org.modeshape:modeshape-parent:3.7-SNAPSHOT, C:\Projet_Gestion_Documents\Projects\TEST_MODSHAPE\modeshape-master\modeshape-parent\pom.xml, line 3, column 13
[WARNING] 'build.plugins.plugin.version' for org.codehaus.mojo:gwt-maven-plugin is missing. @ line 193, column 12
[WARNING]
[WARNING] It is highly recommended to fix these problems because they threaten the stability of your build.
[WARNING]
[WARNING] For this reason, future Maven versions might no longer support building such malformed projects.
[WARNING]
[INFO]
[INFO] ------------------------------------------------------------------------
[INFO] Building ModeShape Repository Explorer (Bare) 3.7-SNAPSHOT
[INFO] ------------------------------------------------------------------------
[WARNING] The POM for org.modeshape:modeshape-jcr-api:jar:3.7-SNAPSHOT is missing, no dependency information available
[WARNING] The POM for org.modeshape:modeshape-common:jar:3.7-SNAPSHOT is missing, no dependency information available
[WARNING] The POM for smartgwt:smartgwt:jar:2.4 is missing, no dependency information available
[WARNING] The POM for org.modeshape:modeshape-web-jcr:jar:3.7-SNAPSHOT is missing, no dependency information available
[INFO] ------------------------------------------------------------------------
[INFO] BUILD FAILURE
[INFO] ------------------------------------------------------------------------
[INFO] Total time: 0.974s
[INFO] Finished at: Mon Jun 30 15:46:22 CEST 2014
[INFO] Final Memory: 8M/152M
[INFO] ------------------------------------------------------------------------
[ERROR] Failed to execute goal on project modeshape-web-explorer: Could not resolve dependencies for project org.modeshape:modeshape-web-explorer:war:3.7-SNAPSHOT: Could not find artifact org.modeshape:modeshape-jcr-api:jar:3.7-SNAPSHOT -> [Help 1]
[ERROR]
[ERROR] To see the full stack trace of the errors, re-run Maven with the -e switch.
[ERROR] Re-run Maven using the -X switch to enable full debug logging.
[ERROR]
[ERROR] For more information about the errors and possible solutions, please read the following articles:
[ERROR] [Help 1] http://cwiki.apache.org/confluence/display/MAVEN/DependencyResolutionException



this is my pom file



advance thanks
6 years ago
hello,
as i have mentioned in my reply ; i told that i use 3.7.4 ;


posted 23/6/2014 15:14:01
i have tried with 3.7.4 ; the same error
6 years ago
thank you for the reply.
i'm new to maeven ; is there any simple tutorial to use maeven.
that will be a great help
6 years ago
i dont get you ; what do you mean by start with that
is the screen shot is not clear
6 years ago
i dont use maven in command line
i import a project that i have downloaded ; as soon as the import is finished, i have the errors as show in the screen shot above
6 years ago
i have tried with 3.7.4 ; the same error
6 years ago